{"text_format":"1","workbook":"xlsx","n_sheets":17,"sheets":["Front Sheet","PE EST","PE SITE SUM","PE SOW","PE SOW SUM","New PE EST","New PE EST (2)","New PE EST (3)","New PE SUM","queries AND VERSION CONTROL","Sheet1","BARR EST","BARR EST (2)","BARR EST (3)","BARR SUM","PE Rates","Rates"],"not_rendered":{"charts":0,"images":11,"macros":1,"external_links":1,"defined_names":0,"comments":0,"pivot_tables":0},"unopened":[],"bounds":{"document_bytes":16777216,"sheet_cells":100000,"rows_first":2000,"rows_last":500,"rows_between":2000,"halvings":0,"cell_chars":16384,"cell_head_chars":4096},"cells_cut":0,"cells_raw":0,"read":"whole","date_system":"1900"}

{"sheet":"Front Sheet","index":0,"n_rows":38,"n_cols":20,"rows_kept":38,"cut":false,"hidden":false,"merged":[[1,1,5,21],[16,2,16,20],[17,2,17,21],[18,2,18,20]]}
[]
[null,"Calculate your estimated charges for mains requisition work\nEstimation based on Severn Trent new connection charges 2025/26\nLast updated:  February 2025\n"]
[]
[]
[]
[]
[]
[null,"Before you get started there are a few things you'll need to understand…"]
[]
[null,"l","The estimated charges are calculated using Severn Trent's 2025/26 new connections charges."]
[null,"l","The estimated charges relate to mains requisitions work completed by Severn Trent."]
[null,"l","This estimator can be used to estimate the cost of the onsite mains scheme that needs to be paid based on the site information you provide."]
[null,"l","The estimated charges should not be taken as a final quote, agreed terms or an offer to carry out works at an agreed price."]
[null,"l","The estimated charges can be calculated for PE (polyethylene) sites and protective pipe sites. "]
[null,"l","PE sites refer to standard pipework used when the ground is not contaminated and our estimation is based on a bespoke build up of a schedule of rates."]
[null,"l","The estimated costs for onsite ground is unmade."]
[null,"l","Protective pipework refers to sites where protective pipework is required because the ground is contaminated and our estimation is based on a bespoke build up of a schedule of rates."]
[null,"l","Figures for total cost are Gross estimated values, this figure represents the total onsite cost of construction required for this site. Any work that Severn Trent will be required to carry out, (whether contestable or non-contestable) has not been deducted, deferred or 'netted' off this figure."]
[null,"l","To provide a simple estimate of likely charges we have had to make a number of assumptions about your site. A formal quote, based on full information provided by you about your site, may therefore differ."]
[null,"l","The protective pipe & PE pipe estimated charges allows you to select onsite pipework with three lengths of different pipe diameters. Offsite pipework can only be selected as a single length of one diameter."]
{"$rows_left_out":19}
{"sheet":"PE EST","index":1,"n_rows":42,"n_cols":29,"rows_kept":42,"cut":false,"hidden":false,"merged":[[35,28,35,31],[36,28,36,31],[9,2,9,4],[13,2,13,4],[19,2,19,4],[33,2,33,4],[33,6,33,9],[34,6,34,9],[35,6,35,9],[118,6,120,6],[1,1,3,21],[4,4,4,5],[4,2,4,3],[36,6,36,9],[96,5,96,8],[97,5,97,8],[98,5,98,8],[99,5,99,8],[100,5,100,8],[33,10,33,20],[34,10,34,20],[35,10,35,20],[36,10,37,20]]}
[]
[null,"Calculate your estimated PE charges\nThis estimation should only be used for standard PE schemes where sites have between 5 and 250 plots.\n"]
[]
[]
[null,"HOME","PE CHARGES",null,"PROTECTIVE PIPE CHARGES",null,null,null,null,null,null,null,null,null,null,null,null,null,null,null,"<<PREV","NEXT>>"]
[]
[null,"Question 1",null,"How many plots do you have on your site?"]
[null,null,"* Our standard and fixed charges only apply to schemes with between 5 and 250 plots. If your scheme is outside of this you will require a bespoke quote for your site."]
[]
[null,"Answer 1",null,null,null,"Plots"]
[]
[null,"Question 2",null,"Do you require us to simply lay your new main (lay only) or excavate the trench and lay the main (open cut)?"]
[]
[null,"Answer 2","Open cut"]
[]
[null,"Question 3",null,"What is the estimated length of main from the edge of your development site to our existing network? (ie distance to the SOW connection)"]
[null,null,"* If you're unsure of the length at this stage enter the width of the adjacent road"]
[null,null,"* The length we are referring to here is shown in the diagram on the right"]
[]
[null,"Answer 3",null,null,null,"m"]
{"$rows_left_out":23}
{"sheet":"PE SITE SUM","index":2,"n_rows":42,"n_cols":22,"rows_kept":42,"cut":false,"hidden":false,"merged":[[73,4,73,8],[74,4,74,8],[92,5,94,5],[70,4,70,8],[71,4,71,8],[1,1,3,21],[4,2,4,3],[4,4,4,5],[6,1,7,21],[72,4,72,8],[9,4,10,6],[15,4,16,6],[21,4,22,6],[25,4,26,6],[9,1,9,3],[15,1,15,3],[21,1,21,3],[25,1,25,3]]}
[]
[null,"Summary of your total site estimated charges\nThe total cost estimate for your scheme is based on the information you have provided\n"]
[]
[]
[null,"HOME","PE CHARGES",null,"PROTECTIVE PIPE CHARGES",null,null,null,null,null,null,null,null,null,null,null,null,null,null,null,"<<PREV","NEXT>>"]
[]
[null,"This is shown as a single figure because our simplified PE 'per plot' charges include the cost of all contributing elements (eg pipework, connection, fittings, traffic management etc) "]
[]
[]
[null,"Total cost",null,null,{"$f":"(IF('PE EST'!C14=\"Lay only\",U15,U16)*'PE EST'!C10)+((VLOOKUP('PE EST'!C34,Q19:U21,5,FALSE))*MAX(0,'PE EST'!C20-22))","v":0}]
[]
[]
[]
[null,"If you are choosing a self lay provider to lay your new main the total asset payment is below:",null,null,null,null,null,null,null,null,null,null,null,null,null,null,"Per plot charges (PE)"]
[null,null,null,null,null,null,null,null,null,null,null,null,null,null,null,null,"Lay only",null,null,null,620.58000000000004]
[null,"Asset payment",null,null,{"$f":"E10*0.9","v":0},null,null,null,null,null,null,null,null,null,null,null,"Open cut",null,null,null,896.3]
[null,null,null,null,null,null,null,"(equivalent to 90% of total construction costs)"]
[null,null,null,null,null,null,null,null,null,null,null,null,null,null,null,null,"Per metre charges >22m (PE)"]
[null,null,null,null,null,null,null,null,null,null,null,null,null,null,null,null,"No excavation",null,null,null,24.27]
[null,"If you are choosing Severn Trent to lay your new main the income offset and developer contribution are below:",null,null,null,null,null,null,null,null,null,null,null,null,null,null,"Excavation in unmade ground",null,null,null,48.67]
{"$rows_left_out":23}
{"sheet":"PE SOW","index":3,"n_rows":42,"n_cols":22,"rows_kept":42,"cut":false,"hidden":false,"merged":[[36,2,36,4],[20,8,21,19],[1,1,3,21],[4,2,4,3],[4,4,4,5],[19,2,19,4],[30,2,30,4],[30,7,30,9],[22,8,22,19],[23,8,23,19],[24,8,24,19],[19,6,19,7],[19,8,19,19],[20,6,21,7]]}
[]
[null,"Calculate your source of water charges\nIf you would like to understand the specific cost of the connection between the new main and the existing main (otherwise known as the source of water connection) we just need a little more information"]
[]
[]
[null,"HOME","PE CHARGES",null,"PROTECTIVE PIPE CHARGES",null,null,null,null,null,null,null,null,null,null,null,null,null,null,null,"<<PREV","NEXT>>"]
[]
[null,"The SOW estimate covers the assets shown in the diagram"]
[]
[]
[]
[]
[]
[]
[]
[]
[]
[null,"Question 1",null,"What are the excavation requirements offsite?"]
[null,null,"* If you are unsure what your excavation requirements will be select the worst case scenario. This is likely to be 'type 1/2 carriageway' for self lay providers (highest charge)"]
[]
[null,"Answer 1","Type 1/2 CW",null,null,null,"Option",null,"Description"]
{"$rows_left_out":23}
{"sheet":"PE SOW SUM","index":4,"n_rows":42,"n_cols":21,"rows_kept":42,"cut":false,"hidden":false,"merged":[[1,1,3,21],[4,2,4,3],[4,4,4,5],[9,1,9,3],[9,4,10,6],[9,8,11,20],[71,4,71,8],[72,4,72,8],[73,4,73,8],[74,4,74,8],[92,5,94,5],[17,8,19,20],[22,8,24,20],[23,0,23,3],[18,0,18,3],[70,4,70,8],[17,1,17,3],[17,4,18,6],[22,1,22,3],[22,4,23,6]]}
[]
[null,"Summary of source of water estimated charges\nThe total cost estimate for your scheme is based on the information you have provided\n"]
[]
[]
[null,"HOME","PE CHARGES",null,"PROTECTIVE PIPE CHARGES",null,null,null,null,null,null,null,null,null,null,null,null,null,null,null,"<<PREV"]
[]
[]
[null,null,null,null,null,null,null,null,"Specific assumptions"]
[]
[null,"Total SOW cost",null,null,{"$f":"SUM(E18+E23)","v":9531.7415000000019},null,null,null,"The SOW cost includes an allowance for valves, wash outs and trial holes. This SOW cost does include the length of main connecting into the connection itself based on the answer to Question 2. The SOW cost assumes temporary two way traffic lights are required."]
[]
[]
[]
[]
[]
[null,"This total SOW cost is split by contestable and non-contestable elements below:"]
[]
[null,"Off-site pipework cost",null,null,{"$f":"(Rates!C345+Rates!C353+Rates!C354)*0.1","v":125.495},null,null,null,"This pipework cost is solely the cost of the length of pipework specified in response to Question 2. It does not include any valves or other fittings."]
[" (laying of main into SOW)"]
[null,null,null,null,null,null,"Contestable"]
{"$rows_left_out":23}
{"sheet":"New PE EST","index":5,"n_rows":42,"n_cols":22,"rows_kept":42,"cut":false,"hidden":false,"merged":[[25,2,25,4],[25,6,25,8],[25,10,27,19],[26,2,26,4],[26,6,26,8],[1,1,3,21],[4,2,4,3],[4,4,4,5],[6,1,6,20],[7,1,9,7],[88,5,88,8],[89,5,89,8],[90,5,90,8],[108,6,110,6],[27,2,27,4],[27,6,27,8],[34,2,34,4],[86,5,86,8],[87,5,87,8],[34,8,34,19],[35,8,36,19],[28,2,28,4],[28,6,28,8]]}
[]
[null,"Calculate your estimated PE pipe charges\nThis estimate should be used for PE pipework schemes. "]
[]
[]
[null,"HOME","PE CHARGES",null,"PROTECTIVE PIPE CHARGES",null,null,null,null,null,null,null,null,null,null,null,null,null,null,null,"<<PREV","NEXT>>"]
[]
[]
[null,"The diagram to the right shows a typical mains site and highlights which assets are being referenced in each question."]
[]
[]
[]
[]
[]
[]
[]
[]
[]
[null,"ASSETS WITHIN YOUR SITE BOUNDARY"]
[]
[null,"Question 1",null,"What is the estimated length of main on your development site (within the boundaries of your site)?"]
{"$rows_left_out":23}
{"sheet":"New PE EST (2)","index":6,"n_rows":42,"n_cols":22,"rows_kept":42,"cut":false,"hidden":false,"merged":[[20,2,21,18],[1,1,3,21],[4,2,4,3],[4,4,4,5],[11,2,11,4],[16,2,16,4],[27,9,27,20],[28,9,28,20],[23,2,23,4],[23,7,23,8],[23,9,23,20],[24,7,25,8],[24,9,25,20],[26,9,26,20]]}
[]
[null,"Calculate your estimated PE pipe charges\nThis estimate should be used for PE pipe schemes. "]
[]
[]
[null,"HOME","PE CHARGES",null,"PROTECTIVE PIPE CHARGES",null,null,null,null,null,null,null,null,null,null,null,null,null,null,null,"<<PREV","NEXT>>"]
[]
[null,"OFF-STE MAINS 'CONNECTION' LENGTH"]
[]
[null,"Question 1",3,"What is the estimated length of offsite main (from the edge of your development site to our existing network? ie distance to the SOW connection)"]
[null,null,"* If you're unsure of the length at this stage enter the width of the adjacent road"]
[]
[null,"Answer 3",null,null,null,"m"]
[]
[null,"Question 2",4,"What diameter of mains pipework do you require off-site?"]
[null,null,"* If you're unsure of the diameter at this stage please select 126 to 180mm"]
[]
[null,"Answer 4",null,null,null,"mm"]
[]
[null,"Question 2",5,"What are the excavation requirements off-site?"]
[null,null,"* This is solely for the length of mains between the edge of your development site and our existing network"]
{"$rows_left_out":23}
{"sheet":"New PE EST (3)","index":7,"n_rows":42,"n_cols":22,"rows_kept":42,"cut":false,"hidden":false,"merged":[[1,1,3,21],[4,2,4,3],[4,4,4,5],[11,2,11,4]]}
[]
[null,"Calculate your estimated PE pipe charges\nThis estimate should be used for PE pipe schemes. "]
[]
[]
[null,"HOME","PE CHARGES",null,"PROTECTIVE PIPE CHARGES",null,null,null,null,null,null,null,null,null,null,null,null,null,null,null,"<<PREV","NEXT>>"]
[]
[null,"PHYSICAL SOW CONNECTION"]
[]
[null,"Question 1",6,"What diameter connection do you need between the new mains and our existing mains (also known as SOW connection)?"]
[null,null,"* If you are unsure of your pipework diameter at this stage please select 150-200mm"]
[]
[null,"Answer 6",null,null,null,"mm"]
[]
[]
[]
[null,"EXISTING MAINS"]
[]
[null,"Question 2",7,"Are there any existing mains on site which need to be abandoned? (We refer to this as 'capping off')."]
[null,null,"* Please enter the number of each type of asset below"]
[]
{"$rows_left_out":23}
{"sheet":"New PE SUM","index":8,"n_rows":42,"n_cols":21,"rows_kept":42,"cut":false,"hidden":false,"merged":[[21,1,23,7],[23,9,24,11],[1,1,3,21],[4,2,4,3],[4,4,4,5],[8,5,9,7],[7,9,9,20],[25,5,26,7],[25,9,27,20],[27,5,28,7],[146,6,148,6],[29,5,30,7],[29,9,31,20],[124,5,124,8],[125,5,125,8],[126,5,126,8],[127,5,127,8],[128,5,128,8],[30,3,30,4],[31,5,32,7],[33,5,34,7],[33,9,35,20],[34,3,34,4]]}
[]
[null,"Summary of PE pipe estimated charges\nThe total estimated cost for your scheme based on the information you've entered is shown below."]
[]
[]
[null,"HOME","PE CHARGES",null,"PROTECTIVE PIPE CHARGES",null,null,null,null,null,null,null,null,null,null,null,null,null,null,null,"<<PREV"]
[]
[]
[null,null,null,null,null,null,null,null,{"$f":"SUM('New PE EST'!G26+'New PE EST'!G27+'New PE EST'!G28+'New PE EST (2)'!C12)","v":0}]
[null,"Total cost (including SOW)",null,null,null,{"$f":"'PE Rates'!B244+'PE Rates'!B241+'PE Rates'!B222+'PE Rates'!B227","v":{"$error":"#N/A"}}]
[]
[]
[]
[]
[null,"The SOW estimate covers the assets shown in the diagram:"]
[]
[]
[]
[]
[]
[]
{"$rows_left_out":23}
{"sheet":"queries AND VERSION CONTROL","index":9,"n_rows":101,"n_cols":11,"rows_kept":101,"cut":false,"hidden":false,"merged":[[65,1,65,19],[69,1,69,20],[70,1,70,20]]}
[]
[null,"PE RATES","check with steve first, as i dont think we can convert it if we dont have a published charge"]
[]
[null,"phase 2 tests - designers tested"]
[]
[null,"changed titles on PE Pipes pages"]
[]
[null,"Changed dates"]
[]
[null,"Changed prices to 2021-22"]
[]
[null,"corrected errors in RATES alignment "]
[]
[null,"developer contact"]
[]
[null,"break-down of add-ons"]
[null,"old price",null,"new price"]
[null,154.9546463586,null,170.44,null,"Rates B204"]
[]
[null,588.70000000000005,null,661.28,null,"Rates B203"]
{"$rows_left_out":82}
{"sheet":"Sheet1","index":10,"n_rows":4,"n_cols":3,"rows_kept":4,"cut":false,"hidden":false,"merged":[]}
[]
[null,null,{"$f":"'BARR EST'!C33","v":0}]
[]
[null,null,{"$f":"'New PE EST'!C35","v":"Unmade"}]

{"sheet":"BARR EST","index":11,"n_rows":42,"n_cols":22,"rows_kept":42,"cut":false,"hidden":false,"merged":[[88,5,88,8],[89,5,89,8],[90,5,90,8],[108,6,110,6],[86,5,86,8],[87,5,87,8],[34,8,35,19],[1,1,3,21],[4,2,4,3],[4,4,4,5],[26,2,26,4],[32,2,32,4],[28,6,28,8],[6,1,7,20],[8,1,10,7],[26,10,28,19],[27,2,27,4],[28,2,28,4],[26,6,26,8],[27,6,27,8]]}
[]
[null,"Calculate your estimated protective pipe charges\nThis estimate should be used for protective pipe schemes. "]
[]
[]
[null,"HOME","PE CHARGES",null,"PROTECTIVE PIPE CHARGES",null,null,null,null,null,null,null,null,null,null,null,null,null,null,null,"<<PREV","NEXT>>"]
[]
[null,"Our charging structure for protective pipe schemes is bespoke and therefore we ask you a few more questions here than we do in the PE estimator so we can put together an estimate based on our more granular protective pipe charges."]
[]
[null,"The diagram to the right shows a typical mains site and highlights which assets are being referenced in each question."]
[]
[]
[]
[]
[]
[]
[]
[]
[]
[null,"ASSETS WITHIN YOUR SITE BOUNDARY"]
[]
{"$rows_left_out":23}
{"sheet":"BARR EST (2)","index":12,"n_rows":42,"n_cols":22,"rows_kept":42,"cut":false,"hidden":false,"merged":[[27,9,27,20],[28,9,28,20],[11,2,11,4],[23,2,23,4],[20,2,21,18],[23,7,23,8],[23,9,23,20],[24,7,25,8],[16,2,16,4],[1,1,3,21],[4,2,4,3],[4,4,4,5],[24,9,25,20],[26,9,26,20]]}
[]
[null,"Calculate your estimated protective pipe charges\nThis estimate should be used for protective pipe schemes. "]
[]
[]
[null,"HOME","PE CHARGES",null,"PROTECTIVE PIPE CHARGES",null,null,null,null,null,null,null,null,null,null,null,null,null,null,null,"<<PREV","NEXT>>"]
[]
[null,"OFF-STE MAINS 'CONNECTION' LENGTH"]
[]
[null,"Question 1",3,"What is the estimated length of offsite main (from the edge of your development site to our existing network? ie distance to the SOW connection)"]
[null,null,"* If you're unsure of the length at this stage enter the width of the adjacent road"]
[]
[null,"Answer 3",null,null,null,"m"]
[]
[null,"Question 2",4,"What diameter of mains pipework do you require off-site?"]
[null,null,"* If you're unsure of the diameter at this stage please select 126 to 180mm"]
[]
[null,"Answer 4",null,null,null,"mm"]
[]
[null,"Question 2",5,"What are the excavation requirements off-site?"]
[null,null,"* This is solely for the length of mains between the edge of your development site and our existing network"]
{"$rows_left_out":23}
{"sheet":"BARR EST (3)","index":13,"n_rows":42,"n_cols":22,"rows_kept":42,"cut":false,"hidden":false,"merged":[[1,1,3,21],[4,2,4,3],[4,4,4,5],[11,2,11,4]]}
[]
[null,"Calculate your estimated protective pipe charges\nThis estimate should be used for protective pipe schemes. "]
[]
[]
[null,"HOME","PE CHARGES",null,"PROTECTIVE PIPE CHARGES",null,null,null,null,null,null,null,null,null,null,null,null,null,null,null,"<<PREV","NEXT>>"]
[]
[null,"PHYSICAL SOW CONNECTION"]
[]
[null,"Question 1",6,"What diameter connection do you need between the new mains and our existing mains (also known as SOW connection)?"]
[null,null,"* If you are unsure of your pipework diameter at this stage please select 150-200mm"]
[]
[null,"Answer 6",null,null,null,"mm"]
[]
[]
[]
[null,"EXISTING MAINS"]
[]
[null,"Question 2",7,"Are there any existing mains on site which need to be abandoned? (We refer to this as 'capping off')."]
[null,null,"* Please enter the number of each type of asset below"]
[]
{"$rows_left_out":23}
{"sheet":"BARR SUM","index":14,"n_rows":42,"n_cols":21,"rows_kept":42,"cut":false,"hidden":false,"merged":[[27,5,28,7],[31,5,32,7],[30,3,30,4],[34,3,34,4],[25,9,27,20],[29,9,31,20],[33,9,35,20],[25,5,26,7],[29,5,30,7],[33,5,34,7],[128,5,128,8],[146,6,148,6],[124,5,124,8],[125,5,125,8],[126,5,126,8],[127,5,127,8],[1,1,3,21],[4,2,4,3],[4,4,4,5],[23,9,23,11],[7,5,8,7],[7,9,9,20]]}
[]
[null,"Summary of protective pipe estimated charges\nThe total estimated cost for your scheme based on the information you've entered is shown below."]
[]
[]
[null,"HOME","PE CHARGES",null,"PROTECTIVE PIPE CHARGES",null,null,null,null,null,null,null,null,null,null,null,null,null,null,null,"<<PREV"]
[]
[]
[null,"Total cost (including SOW)",null,null,null,{"$f":"IF(I8=0,\"£0.00\",SUM(Rates!C195+SUM(Rates!B216:B218)+SUM(Rates!C200:C205)))","v":"£0.00"},null,null,{"$f":"SUM('BARR EST'!G27+'BARR EST'!G28+'BARR EST'!G29+'BARR EST (2)'!C12)","v":0}]
[]
[]
[]
[]
[]
[]
[]
[]
[]
[]
[]
[]
{"$rows_left_out":23}
{"sheet":"PE Rates","index":15,"n_rows":245,"n_cols":8,"rows_kept":245,"cut":false,"hidden":true,"merged":[[225,4,225,6],[226,4,226,6],[228,4,228,6],[229,4,229,6]]}
["Full description of required works",null,null,null,"CONCATENATE","ST charge (£)","Diameter","Excavation requirement"]
["Mains laying rates"]
["Blank dummy lines to enable formula for onsite mains cost to work",null,null,null,{"$f":"CONCATENATE(G3,H3)","v":"No excavation"},0,null,"No excavation"]
["Blank dummy lines to enable formula for onsite mains cost to work",null,null,null,"Unmade",0,null,"Unmade"]
["Blank dummy lines to enable formula for onsite mains cost to work",null,null,null,"Footpath",0,null,"Footpath"]
["Blank dummy lines to enable formula for onsite mains cost to work",null,null,null,"Type 3/4 CW",0,null,"Type 3/4 CW"]
["Blank dummy lines to enable formula for onsite mains cost to work",null,null,null,"Type 1/2 CW",0,null,"Type 1/2 CW"]
["PE main laying, n.e 2m depth, up to 63mm NB No excavation",null,null,null,"up to 63No excavation",20.23,"up to 63","No excavation"]
["PE main laying, n.e 2m depth, up to 63mm NB in Unmade",null,null,null,"up to 63Unmade",50.36,"up to 63","Unmade"]
["PE main laying, n.e 2m depth, up to 63mm NB in Footpath",null,null,null,"up to 63Footpath",118.57,"up to 63","Footpath"]
["PE main laying, n.e 2m depth, up to 63mm NB in Type 3/4 CW",null,null,null,"up to 63Type 3/4 CW",156.08000000000001,"up to 63","Type 3/4 CW"]
["PE main laying, n.e 2m depth, up to 63mm NB in Type 1/2 CW",null,null,null,"up to 63Type 1/2 CW",180.83,"up to 63","Type 1/2 CW"]
["PE main laying, n.e 2m depth, up to 90mm NB No excavation",null,null,null,"64 to 90No excavation",22.18,"64 to 90","No excavation"]
["PE main laying, n.e 2m depth, up to 90mm NB in Unmade",null,null,null,"64 to 90Unmade",52.32,"64 to 90","Unmade"]
["PE main laying, n.e 2m depth, up to 90mm NB in Footpath",null,null,null,"64 to 90Footpath",120.63,"64 to 90","Footpath"]
["PE main laying, n.e 2m depth, up to 90mm NB in Type 3/4 CW",null,null,null,"64 to 90Type 3/4 CW",158.22999999999999,"64 to 90","Type 3/4 CW"]
["PE main laying, n.e 2m depth, up to 90mm NB in Type 1/2 CW",null,null,null,"64 to 90Type 1/2 CW",182.95,"64 to 90","Type 1/2 CW"]
["PE main laying, n.e 2m depth, up to 125mm NB No excavation",null,null,null,"91 to 125No excavation",26.35,"91 to 125","No excavation"]
["PE main laying, n.e 2m depth, up to 125mm NB in Unmade",null,null,null,"91 to 125Unmade",56.47,"91 to 125","Unmade"]
["PE main laying, n.e 2m depth, up to 125mm NB in Footpath",null,null,null,"91 to 125Footpath",124.86,"91 to 125","Footpath"]
{"$rows_left_out":226}
{"sheet":"Rates","index":16,"n_rows":366,"n_cols":8,"rows_kept":366,"cut":false,"hidden":true,"merged":[[198,4,198,6],[199,4,199,6],[201,4,201,6],[202,4,202,6]]}
["Full description of required works","Code","Unit of measure",null,"CONCATENATE","ST charge (£)","Diameter","Excavation requirement"]
["Mains laying rates"]
["Blank dummy lines to enable formula for onsite mains cost to work",null,null,null,{"$f":"CONCATENATE(G3,H3)","v":"No excavation"},0,null,"No excavation"]
["Blank dummy lines to enable formula for onsite mains cost to work",null,null,null,"Unmade",0,null,"Unmade"]
["Blank dummy lines to enable formula for onsite mains cost to work",null,null,null,"Footpath",0,null,"Footpath"]
["Blank dummy lines to enable formula for onsite mains cost to work",null,null,null,"Type 3/4 CW",0,null,"Type 3/4 CW"]
["Blank dummy lines to enable formula for onsite mains cost to work",null,null,null,"Type 1/2 CW",0,null,"Type 1/2 CW"]
["Puriton main laying, n.e 2m depth, up to 125mm NB No excavation","DR051","m",null,"up to 125No excavation",68.38,"up to 125","No excavation"]
["Puriton main laying, n.e 2m depth, up to 125mm NB in Unmade","DR052","m",null,"up to 125Unmade",88.78,"up to 125","Unmade"]
["Puriton main laying, n.e 2m depth, up to 125mm NB in Footpath","DR053","m",null,"up to 125Footpath",158.09,"up to 125","Footpath"]
["Puriton main laying, n.e 2m depth, up to 125mm NB in Type 3/4 CW","DR054","m",null,"up to 125Type 3/4 CW",189.85,"up to 125","Type 3/4 CW"]
["Puriton main laying, n.e 2m depth, up to 125mm NB in Type 1/2 CW","DR055","m",null,"up to 125Type 1/2 CW",220.88,"up to 125","Type 1/2 CW"]
["Puriton main laying, n.e 2m depth, up to 180mm NB No excavation","DR056","m",null,"126 to 180No excavation",89.38,"126 to 180","No excavation"]
["Puriton main laying, n.e 2m depth, up to 180mm NB in Unmade","DR057","m",null,"126 to 180Unmade",115.39,"126 to 180","Unmade"]
["Puriton main laying, n.e 2m depth, up to 180mm NB in Footpath","DR058","m",null,"126 to 180Footpath",191.88,"126 to 180","Footpath"]
["Puriton main laying, n.e 2m depth, up to 180mm NB in Type 3/4 CW","DR059","m",null,"126 to 180Type 3/4 CW",229.54,"126 to 180","Type 3/4 CW"]
["Puriton main laying, n.e 2m depth, up to 180mm NB in Type 1/2 CW","DR060","m",null,"126 to 180Type 1/2 CW",287.69,"126 to 180","Type 1/2 CW"]
["Puriton main laying, n.e 2m depth, up to 200 mm NB No excavation","DR061","m",null,"181 to 200No excavation",154.18,"181 to 200","No excavation"]
["Puriton main laying, n.e 2m depth, up to 200 mm NB in Unmade","DR062","m",null,"181 to 200Unmade",190.94,"181 to 200","Unmade"]
["Puriton main laying, n.e 2m depth, up to 200mm NB in Footpath","DR063","m",null,"181 to 200Footpath",326.77999999999997,"181 to 200","Footpath"]
{"$rows_left_out":346}